FailedKonsollutskrift

Started by BitBucket push by thoni56
Started by BitBucket push by thoni56
Building in workspace C:\Program Files (x86)\Jenkins\workspace\Alan
 > c:\Program Files\Git\bin\git.exe rev-parse --is-inside-work-tree # timeout=10
Fetching changes from the remote Git repository
 > c:\Program Files\Git\bin\git.exe config remote.origin.url git@bitbucket.org:alanif/alan.git # timeout=10
Fetching upstream changes from git@bitbucket.org:alanif/alan.git
 > c:\Program Files\Git\bin\git.exe --version # timeout=10
using GIT_SSH to set credentials 
 > c:\Program Files\Git\bin\git.exe fetch --tags --progress git@bitbucket.org:alanif/alan.git +refs/heads/*:refs/remotes/origin/*
 > c:\Program Files\Git\bin\git.exe rev-parse "refs/remotes/origin/master^{commit}" # timeout=10
 > c:\Program Files\Git\bin\git.exe rev-parse "refs/remotes/origin/origin/master^{commit}" # timeout=10
Checking out Revision 6e33c80e2851e38d9c93813f5a04e715ea54efe3 (refs/remotes/origin/master)
 > c:\Program Files\Git\bin\git.exe config core.sparsecheckout # timeout=10
 > c:\Program Files\Git\bin\git.exe checkout -f 6e33c80e2851e38d9c93813f5a04e715ea54efe3
Commit message: "Add consistent '--version' to both compiler and interpreter"
 > c:\Program Files\Git\bin\git.exe rev-list --no-walk 3d12d70274e00f83fab94ca89e43233c79614ca3 # timeout=10
[Alan] $ c:\cygwin32\bin\bash --login C:\WINDOWS\TEMP\jenkins6280409557312630096.sh
CYGWIN_NT-10.0-WOW thoni64 2.10.0(0.325/5/3) 2018-02-02 15:21 i686 Cygwin
SYSTEM
/cygdrive/c/Program Files (x86)/Jenkins/workspace/Alan
******** Target: clean ***********
make -C compiler clean
make[1]: Entering directory '/cygdrive/c/Program Files (x86)/Jenkins/workspace/Alan/compiler'
make[1]: Leaving directory '/cygdrive/c/Program Files (x86)/Jenkins/workspace/Alan/compiler'
make -C interpreter clean
make[1]: Entering directory '/cygdrive/c/Program Files (x86)/Jenkins/workspace/Alan/interpreter'
make[1]: Leaving directory '/cygdrive/c/Program Files (x86)/Jenkins/workspace/Alan/interpreter'
make -C converter clean
make[1]: Entering directory '/cygdrive/c/Program Files (x86)/Jenkins/workspace/Alan/converter'
make[1]: Leaving directory '/cygdrive/c/Program Files (x86)/Jenkins/workspace/Alan/converter'
BUILDNUMBER = 1840
BUILDVERSION = -1840
******** Target: unit ***********
make -C compiler UNITOUTPUT="--xml TEST" unit
make[1]: Entering directory '/cygdrive/c/Program Files (x86)/Jenkins/workspace/Alan/compiler'
gcc -I../interpreter  -Wall -funsigned-char -g -DBUILD=1840   -MMD -o .unittests/addTest.o -c addTest.c
gcc -I../interpreter  -Wall -funsigned-char -g -DBUILD=1840   -MMD -o .unittests/advTest.o -c advTest.c
gcc -I../interpreter  -Wall -funsigned-char -g -DBUILD=1840   -MMD -o .unittests/atrTest.o -c atrTest.c
gcc -I../interpreter  -Wall -funsigned-char -g -DBUILD=1840   -MMD -o .unittests/claTest.o -c claTest.c
gcc -I../interpreter  -Wall -funsigned-char -g -DBUILD=1840   -MMD -o .unittests/descriptionTest.o -c descriptionTest.c
gcc -I../interpreter  -Wall -funsigned-char -g -DBUILD=1840   -MMD -o .unittests/elmTest.o -c elmTest.c
gcc -I../interpreter  -Wall -funsigned-char -g -DBUILD=1840   -MMD -o .unittests/emitTest.o -c emitTest.c
gcc -I../interpreter  -Wall -funsigned-char -g -DBUILD=1840   -MMD -o .unittests/expTest.o -c expTest.c
gcc -I../interpreter  -Wall -funsigned-char -g -DBUILD=1840   -MMD -o .unittests/extTest.o -c extTest.c
gcc -I../interpreter  -Wall -funsigned-char -g -DBUILD=1840   -MMD -o .unittests/ifidTest.o -c ifidTest.c
gcc -I../interpreter  -Wall -funsigned-char -g -DBUILD=1840   -MMD -o .unittests/insTest.o -c insTest.c
gcc -I../interpreter  -Wall -funsigned-char -g -DBUILD=1840   -MMD -o .unittests/lstTest.o -c lstTest.c
gcc -I../interpreter  -Wall -funsigned-char -g -DBUILD=1840   -MMD -o .unittests/propTest.o -c propTest.c
gcc -I../interpreter  -Wall -funsigned-char -g -DBUILD=1840   -MMD -o .unittests/resTest.o -c resTest.c
gcc -I../interpreter  -Wall -funsigned-char -g -DBUILD=1840   -MMD -o .unittests/resourceTest.o -c resourceTest.c
gcc -I../interpreter  -Wall -funsigned-char -g -DBUILD=1840   -MMD -o .unittests/stmTest.o -c stmTest.c
gcc -I../interpreter  -Wall -funsigned-char -g -DBUILD=1840   -MMD -o .unittests/stxTest.o -c stxTest.c
gcc -I../interpreter  -Wall -funsigned-char -g -DBUILD=1840   -MMD -o .unittests/symTest.o -c symTest.c
gcc -I../interpreter  -Wall -funsigned-char -g -DBUILD=1840   -MMD -o .unittests/utilTest.o -c utilTest.c
gcc -I../interpreter  -Wall -funsigned-char -g -DBUILD=1840   -MMD -o .unittests/vrbTest.o -c vrbTest.c
gcc -I../interpreter  -Wall -funsigned-char -g -DBUILD=1840   -MMD -o .unittests/whrTest.o -c whrTest.c
gcc -I../interpreter  -Wall -funsigned-char -g -DBUILD=1840   -MMD -o .unittests/wrdTest.o -c wrdTest.c
gcc -I../interpreter  -Wall -funsigned-char -g -DBUILD=1840   -MMD -o .unittests/unitList.o -c unitList.c
gcc -I../interpreter  -Wall -funsigned-char -g -DBUILD=1840   -MMD -o .unittests/unitmock.o -c unitmock.c
gcc -I../interpreter  -Wall -funsigned-char -g -DBUILD=1840   -MMD -o .unittests/pmParse.o -c pmParse.c
gcc -I../interpreter  -Wall -funsigned-char -g -DBUILD=1840   -MMD -o .unittests/pmPaSema.o -c pmPaSema.c
gcc -I../interpreter  -Wall -funsigned-char -g -DBUILD=1840   -MMD -o .unittests/pmErr.o -c pmErr.c
gcc -I../interpreter  -Wall -funsigned-char -g -DBUILD=1840   -MMD -o .unittests/smScanx.o -c smScanx.c
gcc -I../interpreter  -Wall -funsigned-char -g -DBUILD=1840   -MMD -o .unittests/smScSema.o -c smScSema.c
gcc -I../interpreter  -Wall -funsigned-char -g -DBUILD=1840   -MMD -o .unittests/alan.o -c alan.c
gcc -I../interpreter  -Wall -funsigned-char -g -DBUILD=1840   -MMD -o .unittests/alt.o -c alt.c
gcc -I../interpreter  -Wall -funsigned-char -g -DBUILD=1840   -MMD -o .unittests/article.o -c article.c
gcc -I../interpreter  -Wall -funsigned-char -g -DBUILD=1840   -MMD -o .unittests/chk.o -c chk.c
gcc -I../interpreter  -Wall -funsigned-char -g -DBUILD=1840   -MMD -o .unittests/cnt.o -c cnt.c
gcc -I../interpreter  -Wall -funsigned-char -g -DBUILD=1840   -MMD -o .unittests/context.o -c context.c
gcc -I../interpreter  -Wall -funsigned-char -g -DBUILD=1840   -MMD -o .unittests/dump.o -c dump.c
gcc -I../interpreter  -Wall -funsigned-char -g -DBUILD=1840   -MMD -o .unittests/encode.o -c encode.c
gcc -I../interpreter  -Wall -funsigned-char -g -DBUILD=1840   -MMD -o .unittests/evt.o -c evt.c
gcc -I../interpreter  -Wall -funsigned-char -g -DBUILD=1840   -MMD -o .unittests/id.o -c id.c
gcc -I../interpreter  -Wall -funsigned-char -g -DBUILD=1840   -MMD -o .unittests/initialize.o -c initialize.c
gcc -I../interpreter  -Wall -funsigned-char -g -DBUILD=1840   -MMD -o .unittests/lim.o -c lim.c
gcc -I../interpreter  -Wall -funsigned-char -g -DBUILD=1840   -MMD -o .unittests/msg.o -c msg.c
gcc -I../interpreter  -Wall -funsigned-char -g -DBUILD=1840   -MMD -o .unittests/nam.o -c nam.c
gcc -I../interpreter  -Wall -funsigned-char -g -DBUILD=1840   -MMD -o .unittests/opt.o -c opt.c
gcc -I../interpreter  -Wall -funsigned-char -g -DBUILD=1840   -MMD -o .unittests/options.o -c options.c
gcc -I../interpreter  -Wall -funsigned-char -g -DBUILD=1840   -MMD -o .unittests/rul.o -c rul.c
gcc -I../interpreter  -Wall -funsigned-char -g -DBUILD=1840   -MMD -o .unittests/sco.o -c sco.c
gcc -I../interpreter  -Wall -funsigned-char -g -DBUILD=1840   -MMD -o .unittests/scr.o -c scr.c
gcc -I../interpreter  -Wall -funsigned-char -g -DBUILD=1840   -MMD -o .unittests/set.o -c set.c
gcc -I../interpreter  -Wall -funsigned-char -g -DBUILD=1840   -MMD -o .unittests/spa.o -c spa.c
gcc -I../interpreter  -Wall -funsigned-char -g -DBUILD=1840   -MMD -o .unittests/srcp.o -c srcp.c
gcc -I../interpreter  -Wall -funsigned-char -g -DBUILD=1840   -MMD -o .unittests/stp.o -c stp.c
gcc -I../interpreter  -Wall -funsigned-char -g -DBUILD=1840   -MMD -o .unittests/str.o -c str.c
gcc -I../interpreter  -Wall -funsigned-char -g -DBUILD=1840   -MMD -o .unittests/syn.o -c syn.c
gcc -I../interpreter  -Wall -funsigned-char -g -DBUILD=1840   -MMD -o .unittests/sysdep.o -c sysdep.c
gcc -I../interpreter  -Wall -funsigned-char -g -DBUILD=1840   -MMD -o .unittests/timing.o -c timing.c
gcc -I../interpreter  -Wall -funsigned-char -g -DBUILD=1840   -MMD -o .unittests/type.o -c type.c
gcc -I../interpreter  -Wall -funsigned-char -g -DBUILD=1840   -MMD -o .unittests/wht.o -c wht.c
cd ..; venum alan time
Alan 3.0beta6 -- Adventure Language System (2018-11-01 10:49)
cd ..; venum alan -print '$v.$r{s$s|}$c' > NEXTRELEASE
cp ../alan.version.c .
gcc -I../interpreter  -Wall -funsigned-char -g -DBUILD=1840   -MMD -o .unittests/alan.version.o -c alan.version.c
gcc -shared -o unittests.dll .unittests/addTest.o .unittests/advTest.o .unittests/atrTest.o .unittests/claTest.o .unittests/descriptionTest.o .unittests/elmTest.o .unittests/emitTest.o .unittests/expTest.o .unittests/extTest.o .unittests/ifidTest.o .unittests/insTest.o .unittests/lstTest.o .unittests/propTest.o .unittests/resTest.o .unittests/resourceTest.o .unittests/stmTest.o .unittests/stxTest.o .unittests/symTest.o .unittests/utilTest.o .unittests/vrbTest.o .unittests/whrTest.o .unittests/wrdTest.o .unittests/unitList.o .unittests/unitmock.o .unittests/pmParse.o .unittests/pmPaSema.o .unittests/pmErr.o .unittests/smScanx.o .unittests/smScSema.o .unittests/alan.o .unittests/alt.o .unittests/article.o .unittests/chk.o .unittests/cnt.o .unittests/context.o .unittests/dump.o .unittests/encode.o .unittests/evt.o .unittests/id.o .unittests/initialize.o .unittests/lim.o .unittests/msg.o .unittests/nam.o .unittests/opt.o .unittests/options.o .unittests/rul.o .unittests/sco.o .unittests/scr.o .unittests/set.o .unittests/spa.o .unittests/srcp.o .unittests/stp.o .unittests/str.o .unittests/syn.o .unittests/sysdep.o .unittests/timing.o .unittests/type.o .unittests/wht.o .unittests/alan.version.o   -L/usr/local/lib -lcgreen 
cgreen-runner ./unittests.dll --suite compiler_unit_tests --xml TEST
gcc -I../interpreter  -Wall -funsigned-char -g -DBUILD=1840    -MMD -o .unittests/util.o -c util.c
gcc -I../interpreter  -Wall -funsigned-char -g -DBUILD=1840    -MMD -o .unittests/lst.o -c lst.c
gcc -I../interpreter  -Wall -funsigned-char -g -DBUILD=1840    -MMD -o .unittests/atr.o -c atr.c
gcc -I../interpreter  -Wall -funsigned-char -g -DBUILD=1840    -MMD -o .unittests/atr_tests.o -c atr_tests.c
gcc -shared -o .unittests/atr_tests.dll .unittests/alan.version.o .unittests/atr.o .unittests/atr_tests.o .unittests/dump.o .unittests/lst.o .unittests/opt.o .unittests/options.o .unittests/sysdep.o .unittests/type.o .unittests/util.o   -L/usr/local/lib -lcgreen 
gcc -I../interpreter  -Wall -funsigned-char -g -DBUILD=1840    -MMD -o .unittests/context_tests.o -c context_tests.c
gcc -shared -o .unittests/context_tests.dll .unittests/alan.version.o .unittests/context.o .unittests/context_tests.o .unittests/dump.o .unittests/lst.o .unittests/opt.o .unittests/options.o .unittests/sysdep.o .unittests/type.o .unittests/util.o   -L/usr/local/lib -lcgreen 
gcc -I../interpreter  -Wall -funsigned-char -g -DBUILD=1840    -MMD -o .unittests/exp.o -c exp.c
gcc -I../interpreter  -Wall -funsigned-char -g -DBUILD=1840    -MMD -o .unittests/exp_tests.o -c exp_tests.c
gcc -shared -o .unittests/exp_tests.dll .unittests/alan.version.o .unittests/dump.o .unittests/exp.o .unittests/exp_tests.o .unittests/lst.o .unittests/opt.o .unittests/options.o .unittests/sysdep.o .unittests/type.o .unittests/util.o   -L/usr/local/lib -lcgreen 
gcc -I../interpreter  -Wall -funsigned-char -g -DBUILD=1840    -MMD -o .unittests/ext.o -c ext.c
gcc -I../interpreter  -Wall -funsigned-char -g -DBUILD=1840    -MMD -o .unittests/ext_tests.o -c ext_tests.c
gcc -shared -o .unittests/ext_tests.dll .unittests/alan.version.o .unittests/dump.o .unittests/ext.o .unittests/ext_tests.o .unittests/lst.o .unittests/opt.o .unittests/options.o .unittests/sysdep.o .unittests/type.o .unittests/util.o   -L/usr/local/lib -lcgreen 
gcc -I../interpreter  -Wall -funsigned-char -g -DBUILD=1840    -MMD -o .unittests/ins.o -c ins.c
gcc -I../interpreter  -Wall -funsigned-char -g -DBUILD=1840    -MMD -o .unittests/ins_tests.o -c ins_tests.c
gcc -shared -o .unittests/ins_tests.dll .unittests/alan.version.o .unittests/dump.o .unittests/ins.o .unittests/ins_tests.o .unittests/lst.o .unittests/opt.o .unittests/options.o .unittests/sysdep.o .unittests/type.o .unittests/util.o   -L/usr/local/lib -lcgreen 
gcc -I../interpreter  -Wall -funsigned-char -g -DBUILD=1840    -MMD -o .unittests/stm.o -c stm.c
gcc -I../interpreter  -Wall -funsigned-char -g -DBUILD=1840    -MMD -o .unittests/stm_tests.o -c stm_tests.c
gcc -shared -o .unittests/stm_tests.dll .unittests/alan.version.o .unittests/dump.o .unittests/lst.o .unittests/opt.o .unittests/options.o .unittests/stm.o .unittests/stm_tests.o .unittests/sysdep.o .unittests/type.o .unittests/util.o   -L/usr/local/lib -lcgreen 
gcc -I../interpreter  -Wall -funsigned-char -g -DBUILD=1840    -MMD -o .unittests/sym.o -c sym.c
gcc -I../interpreter  -Wall -funsigned-char -g -DBUILD=1840    -MMD -o .unittests/sym_tests.o -c sym_tests.c
gcc -shared -o .unittests/sym_tests.dll .unittests/alan.version.o .unittests/dump.o .unittests/lst.o .unittests/opt.o .unittests/options.o .unittests/sym.o .unittests/sym_tests.o .unittests/sysdep.o .unittests/type.o .unittests/util.o   -L/usr/local/lib -lcgreen 
gcc -I../interpreter  -Wall -funsigned-char -g -DBUILD=1840    -MMD -o .unittests/id_tests.o -c id_tests.c
gcc -shared -o .unittests/id_tests.dll .unittests/alan.version.o .unittests/dump.o .unittests/id.o .unittests/id_tests.o .unittests/lst.o .unittests/opt.o .unittests/options.o .unittests/sysdep.o .unittests/type.o .unittests/util.o   -L/usr/local/lib -lcgreen 
gcc -I../interpreter  -Wall -funsigned-char -g -DBUILD=1840    -MMD -o .unittests/whr.o -c whr.c
gcc -I../interpreter  -Wall -funsigned-char -g -DBUILD=1840    -MMD -o .unittests/whr_tests.o -c whr_tests.c
gcc -shared -o .unittests/whr_tests.dll .unittests/alan.version.o .unittests/dump.o .unittests/lst.o .unittests/opt.o .unittests/options.o .unittests/sysdep.o .unittests/type.o .unittests/util.o .unittests/whr.o .unittests/whr_tests.o   -L/usr/local/lib -lcgreen 
cgreen-runner $f --suite Compiler --xml TEST .unittests/atr_tests.dll .unittests/context_tests.dll .unittests/exp_tests.dll .unittests/ext_tests.dll .unittests/ins_tests.dll .unittests/stm_tests.dll .unittests/sym_tests.dll .unittests/id_tests.dll .unittests/whr_tests.dll
make[1]: Leaving directory '/cygdrive/c/Program Files (x86)/Jenkins/workspace/Alan/compiler'
make -C interpreter UNITOUTPUT="--xml TEST" unit
make[1]: Entering directory '/cygdrive/c/Program Files (x86)/Jenkins/workspace/Alan/interpreter'
gcc     -funsigned-char -g -Wall  -DBUILD=1840   -MMD  -o .unittests/argsTests.o -c argsTests.c
gcc     -funsigned-char -g -Wall  -DBUILD=1840   -MMD  -o .unittests/AltInfoTests.o -c AltInfoTests.c
gcc     -funsigned-char -g -Wall  -DBUILD=1840   -MMD  -o .unittests/actTests.o -c actTests.c
gcc     -funsigned-char -g -Wall  -DBUILD=1840   -MMD  -o .unittests/debugTests.o -c debugTests.c
In file included from debugTests.c:4:0:
debug.c:517:13: warning: 'listLines' defined but not used [-Wunused-function]
 static void listLines() {
             ^~~~~~~~~
gcc     -funsigned-char -g -Wall  -DBUILD=1840   -MMD  -o .unittests/exeTests.o -c exeTests.c
gcc     -funsigned-char -g -Wall  -DBUILD=1840   -MMD  -o .unittests/instanceTests.o -c instanceTests.c
gcc     -funsigned-char -g -Wall  -DBUILD=1840   -MMD  -o .unittests/interTests.o -c interTests.c
gcc     -funsigned-char -g -Wall  -DBUILD=1840   -MMD  -o .unittests/mainTests.o -c mainTests.c
gcc     -funsigned-char -g -Wall  -DBUILD=1840   -MMD  -o .unittests/outputTests.o -c outputTests.c
gcc     -funsigned-char -g -Wall  -DBUILD=1840   -MMD  -o .unittests/ParameterPositionTests.o -c ParameterPositionTests.c
gcc     -funsigned-char -g -Wall  -DBUILD=1840   -MMD  -o .unittests/paramsTests.o -c paramsTests.c
gcc     -funsigned-char -g -Wall  -DBUILD=1840   -MMD  -o .unittests/parseTests.o -c parseTests.c
gcc     -funsigned-char -g -Wall  -DBUILD=1840   -MMD  -o .unittests/reverseTests.o -c reverseTests.c
gcc     -funsigned-char -g -Wall  -DBUILD=1840   -MMD  -o .unittests/saveTests.o -c saveTests.c
gcc     -funsigned-char -g -Wall  -DBUILD=1840   -MMD  -o .unittests/setTests.o -c setTests.c
gcc     -funsigned-char -g -Wall  -DBUILD=1840   -MMD  -o .unittests/stackTests.o -c stackTests.c
gcc     -funsigned-char -g -Wall  -DBUILD=1840   -MMD  -o .unittests/stateTests.o -c stateTests.c
gcc     -funsigned-char -g -Wall  -DBUILD=1840   -MMD  -o .unittests/StateStackTests.o -c StateStackTests.c
gcc     -funsigned-char -g -Wall  -DBUILD=1840   -MMD  -o .unittests/sysdepTests.o -c sysdepTests.c
gcc     -funsigned-char -g -Wall  -DBUILD=1840   -MMD  -o .unittests/utilsTests.o -c utilsTests.c
gcc     -funsigned-char -g -Wall  -DBUILD=1840   -MMD  -o .unittests/wordTests.o -c wordTests.c
gcc     -funsigned-char -g -Wall  -DBUILD=1840   -MMD  -o .unittests/Container.o -c Container.c
gcc     -funsigned-char -g -Wall  -DBUILD=1840   -MMD  -o .unittests/Location.o -c Location.c
gcc     -funsigned-char -g -Wall  -DBUILD=1840   -MMD  -o .unittests/actor.o -c actor.c
gcc     -funsigned-char -g -Wall  -DBUILD=1840   -MMD  -o .unittests/attribute.o -c attribute.c
gcc     -funsigned-char -g -Wall  -DBUILD=1840   -MMD  -o .unittests/checkentry.o -c checkentry.c
gcc     -funsigned-char -g -Wall  -DBUILD=1840   -MMD  -o .unittests/class.o -c class.c
gcc     -funsigned-char -g -Wall  -DBUILD=1840   -MMD  -o .unittests/current.o -c current.c
gcc     -funsigned-char -g -Wall  -DBUILD=1840   -MMD  -o .unittests/compatibility.o -c compatibility.c
gcc     -funsigned-char -g -Wall  -DBUILD=1840   -MMD  -o .unittests/decode.o -c decode.c
gcc     -funsigned-char -g -Wall  -DBUILD=1840   -MMD  -o .unittests/dictionary.o -c dictionary.c
gcc     -funsigned-char -g -Wall  -DBUILD=1840   -MMD  -o .unittests/event.o -c event.c
gcc     -funsigned-char -g -Wall  -DBUILD=1840   -MMD  -o .unittests/lists.o -c lists.c
gcc     -funsigned-char -g -Wall  -DBUILD=1840   -MMD  -o .unittests/literal.o -c literal.c
gcc     -funsigned-char -g -Wall  -DBUILD=1840   -MMD  -o .unittests/memory.o -c memory.c
gcc     -funsigned-char -g -Wall  -DBUILD=1840   -MMD  -o .unittests/msg.o -c msg.c
gcc     -funsigned-char -g -Wall  -DBUILD=1840   -MMD  -o .unittests/options.o -c options.c
gcc     -funsigned-char -g -Wall  -DBUILD=1840   -MMD  -o .unittests/readline.o -c readline.c
gcc     -funsigned-char -g -Wall  -DBUILD=1840   -MMD  -o .unittests/rules.o -c rules.c
rules.c:157:13: warning: 'evaluateRulesBeta2New' defined but not used [-Wunused-function]
 static void evaluateRulesBeta2New(void) {
             ^~~~~~~~~~~~~~~~~~~~~
gcc     -funsigned-char -g -Wall  -DBUILD=1840   -MMD  -o .unittests/scan.o -c scan.c
gcc     -funsigned-char -g -Wall  -DBUILD=1840   -MMD  -o .unittests/score.o -c score.c
gcc     -funsigned-char -g -Wall  -DBUILD=1840   -MMD  -o .unittests/syntax.o -c syntax.c
gcc     -funsigned-char -g -Wall  -DBUILD=1840   -MMD  -o .unittests/syserr.o -c syserr.c
gcc     -funsigned-char -g -Wall  -DBUILD=1840   -MMD  -o .unittests/term.o -c term.c
gcc     -funsigned-char -g -Wall  -DBUILD=1840   -MMD  -o .unittests/types.o -c types.c
gcc     -funsigned-char -g -Wall  -DBUILD=1840   -MMD  -o .unittests/fnmatch.o -c fnmatch.c
cd ..; venum alan time
Alan 3.0beta6 -- Adventure Language System (2018-11-01 10:50)
cd ..; venum alan -print '$v.$r{s$s|}$c' > NEXTRELEASE
cp ../alan.version.c .
gcc     -funsigned-char -g -Wall  -DBUILD=1840   -MMD  -o .unittests/alan.version.o -c alan.version.c
gcc   -shared -o unittests.dll .unittests/argsTests.o .unittests/AltInfoTests.o .unittests/actTests.o .unittests/debugTests.o .unittests/exeTests.o .unittests/instanceTests.o .unittests/interTests.o .unittests/mainTests.o .unittests/outputTests.o .unittests/ParameterPositionTests.o .unittests/paramsTests.o .unittests/parseTests.o .unittests/reverseTests.o .unittests/saveTests.o .unittests/setTests.o .unittests/stackTests.o .unittests/stateTests.o .unittests/StateStackTests.o .unittests/sysdepTests.o .unittests/utilsTests.o .unittests/wordTests.o .unittests/Container.o .unittests/Location.o .unittests/actor.o .unittests/attribute.o .unittests/checkentry.o .unittests/class.o .unittests/current.o .unittests/compatibility.o .unittests/decode.o .unittests/dictionary.o .unittests/event.o .unittests/lists.o .unittests/literal.o .unittests/memory.o .unittests/msg.o .unittests/options.o .unittests/readline.o .unittests/rules.o .unittests/scan.o .unittests/score.o .unittests/syntax.o .unittests/syserr.o .unittests/term.o .unittests/types.o .unittests/fnmatch.o .unittests/alan.version.o     -L/usr/local/lib/ -lcgreen -lm #--coverage
cgreen-runner ./unittests.dll --suite interpreter_unit_tests --xml TEST
gcc     -funsigned-char -g -Wall  -DBUILD=1840   -MMD  -o .unittests/sysdep.o -c sysdep.c
gcc     -funsigned-char -g -Wall  -DBUILD=1840   -MMD  -o .unittests/compatibility_tests.o -c compatibility_tests.c
gcc   -shared -o .unittests/compatibility_tests.dll .unittests/compatibility.o .unittests/compatibility_tests.o .unittests/lists.o .unittests/memory.o .unittests/options.o .unittests/sysdep.o     -L/usr/local/lib/ -lcgreen -lm
gcc     -funsigned-char -g -Wall  -DBUILD=1840   -MMD  -o .unittests/exe.o -c exe.c
gcc     -funsigned-char -g -Wall  -DBUILD=1840   -MMD  -o .unittests/exe_tests.o -c exe_tests.c
gcc   -shared -o .unittests/exe_tests.dll .unittests/exe.o .unittests/exe_tests.o .unittests/lists.o .unittests/memory.o .unittests/options.o .unittests/sysdep.o     -L/usr/local/lib/ -lcgreen -lm
gcc     -funsigned-char -g -Wall  -DBUILD=1840   -MMD  -o .unittests/instance.o -c instance.c
gcc     -funsigned-char -g -Wall  -DBUILD=1840   -MMD  -o .unittests/instance_tests.o -c instance_tests.c
gcc   -shared -o .unittests/instance_tests.dll .unittests/instance.o .unittests/instance_tests.o .unittests/lists.o .unittests/memory.o .unittests/options.o .unittests/sysdep.o     -L/usr/local/lib/ -lcgreen -lm
gcc     -funsigned-char -g -Wall  -DBUILD=1840   -MMD  -o .unittests/lists_tests.o -c lists_tests.c
gcc   -shared -o .unittests/lists_tests.dll .unittests/lists.o .unittests/lists_tests.o .unittests/memory.o .unittests/options.o .unittests/sysdep.o     -L/usr/local/lib/ -lcgreen -lm
gcc     -funsigned-char -g -Wall  -DBUILD=1840   -MMD  -o .unittests/memory_tests.o -c memory_tests.c
gcc   -shared -o .unittests/memory_tests.dll .unittests/lists.o .unittests/memory.o .unittests/memory_tests.o .unittests/options.o .unittests/sysdep.o     -L/usr/local/lib/ -lcgreen -lm
gcc     -funsigned-char -g -Wall  -DBUILD=1840   -MMD  -o .unittests/rules_tests.o -c rules_tests.c
gcc   -shared -o .unittests/rules_tests.dll .unittests/lists.o .unittests/memory.o .unittests/options.o .unittests/rules.o .unittests/rules_tests.o .unittests/sysdep.o     -L/usr/local/lib/ -lcgreen -lm
gcc     -funsigned-char -g -Wall  -DBUILD=1840   -MMD  -o .unittests/stack.o -c stack.c
gcc     -funsigned-char -g -Wall  -DBUILD=1840   -MMD  -o .unittests/stack_tests.o -c stack_tests.c
gcc   -shared -o .unittests/stack_tests.dll .unittests/lists.o .unittests/memory.o .unittests/options.o .unittests/stack.o .unittests/stack_tests.o .unittests/sysdep.o     -L/usr/local/lib/ -lcgreen -lm
cgreen-runner $f --suite Interpreter --xml TEST .unittests/compatibility_tests.dll .unittests/exe_tests.dll .unittests/instance_tests.dll .unittests/lists_tests.dll .unittests/memory_tests.dll .unittests/rules_tests.dll .unittests/stack_tests.dll
rm .unittests/lists_tests.o .unittests/exe_tests.o .unittests/compatibility_tests.o .unittests/stack_tests.o .unittests/rules_tests.o .unittests/memory_tests.o .unittests/instance_tests.o
make[1]: Leaving directory '/cygdrive/c/Program Files (x86)/Jenkins/workspace/Alan/interpreter'
make -C converter UNITOUTPUT="--xml TEST" unit
make[1]: Entering directory '/cygdrive/c/Program Files (x86)/Jenkins/workspace/Alan/converter'
gcc -g -Wall  -funsigned-char      -c -o util.o util.c
gcc -g -Wall  -funsigned-char      -c -o util_tests.o util_tests.c
gcc -shared -o util_tests.dll util.o util_tests.o -g -Wall  -funsigned-char    -g  -L /usr/local/lib -lcgreen -lm
rm util_tests.o
make[1]: Leaving directory '/cygdrive/c/Program Files (x86)/Jenkins/workspace/Alan/converter'
******** Target: build ***********
make -C compiler BUILDNUMBER=1840 build
make[1]: Entering directory '/cygdrive/c/Program Files (x86)/Jenkins/workspace/Alan/compiler'
i686-w64-mingw32-gcc -I../interpreter  -Wall -funsigned-char -g -DBUILD=1840  -MMD -o .alan/main.o -c main.c
main.c: In function 'version':
main.c:29:19: error: missing '(' in expression
 #if (BUILD+0) != 0)
                   ^
make[1]: *** [Makefile.common:77: .alan/main.o] Error 1
make[1]: Leaving directory '/cygdrive/c/Program Files (x86)/Jenkins/workspace/Alan/compiler'
make: *** [Makefile.common:24: build] Error 2
Build step 'Execute shell' marked build as failure
[WARNINGS] Skipping publisher since build result is FAILURE
Recording test results
Finished: FAILURE